سبحان الله وبحمده سبحان الله العظيم





غير متواجد
معلومات الكاتب ▼
رقم العضوية : 61
المشاركات : 293
الجنس : ذكر
يتابعهم : 4
يتابعونه : 11
الإجابات المقدمة : 2
الرصيد : 0$
قوة السمعة : 130
20-04-2020 12:36 صباحا
p_1570o66n01

أود مشاركة نظام أرض المعركة الخاص ب Vegas 
النظام كامل وليس به مشاكل العيب الوحيد هوا يلزمه تعريب
النظام تقريبا نفس أكواد الرسمي عند دخول أرض المعركة
تتحول المهارات p
p_1570so8pv1

لا أطول عليكم التحميل :
يجب عليك التسجيل لمشاهدة الرابط

أي مشكلة قم بطرحها في قسم المشاكل والإستفسارات
بالتوفيق للجميع.

 

تم تحرير الموضوع بواسطة :Dev Ahmed Shaban بتاريخ:22-06-2020 03:42 صباحا. سبب التعديل : تغيير العنوان ليتناسق مع باقي العناوين فقط


توقيع: MeTo

Discord: MeTo#3992


 

غير متواجد
معلومات الكاتب ▼
رقم العضوية : 88
المشاركات : 155
الجنس : ذكر
يتابعهم : 0
يتابعونه : 1
الإجابات المقدمة : 1
الرصيد : 0$
قوة السمعة : 50
20-04-2020 02:08 صباحا
[1]
كفوو MeTo 

غير متواجد
معلومات الكاتب ▼
رقم العضوية : 10
المشاركات : 647
الجنس : ذكر
الدعوات : 1
يتابعهم : 4
يتابعونه : 25
الإجابات المقدمة : 16
الرصيد : 0$
قوة السمعة : 430
20-04-2020 02:59 صباحا
[2]
تسلم
ان شاء الله اركبها اذا فضيت

توقيع: CSS
عَنْ أَبِي هُرَيْرَةَ، أَنَّ رَسُولَ اللهِ صَلَّى اللهُ عَلَيْهِ وَسَلَّمَ، قَالَ: ” إِذَا مَاتَ الْإِنْسَانُ انْقَطَعَ عَنْهُ عَمَلُهُ إِلَّا مِنْ ثَلَاثَةٍ: إِلَّا مِنْ صَدَقَةٍ جَارِيَةٍ، أَوْ عِلْمٍ يُنْتَفَعُ بِهِ، أَوْ وَلَدٍ صَالِحٍ يَدْعُو لَهُ ” أخرجه مسلم في صحيحه (3/ 1255)
غير متواجد
معلومات الكاتب ▼
رقم العضوية : 61
المشاركات : 293
الجنس : ذكر
يتابعهم : 4
يتابعونه : 11
الإجابات المقدمة : 2
الرصيد : 0$
قوة السمعة : 130
20-04-2020 03:14 صباحا
[3]
المشاركة الأصلية كتبت بواسطة: CSS
تسلم
ان شاء الله اركبها اذا فضيت

واجب   

توقيع: MeTo

Discord: MeTo#3992


 
غير متواجد
معلومات الكاتب ▼
رقم العضوية : 229
المشاركات : 37
الجنس : ذكر
يتابعهم : 0
يتابعونه : 1
الرصيد : 0$
قوة السمعة : 10
موقعي : زيارة موقعي
20-04-2020 06:48 صباحا
[4]
موضوع جميل تفيد ناس كثير ،، في الاضافات و حصريات ملفاتهم و سيرفراتهم العيب الوحيد فيها الي ما يعرف يركبها او يعربها هناً المشكلة


غير متواجد
معلومات الكاتب ▼
رقم العضوية : 71
المشاركات : 190
الجنس : ذكر
يتابعهم : 0
يتابعونه : 0
الإجابات المقدمة : 1
الرصيد : 0$
قوة السمعة : 30
20-04-2020 08:46 صباحا
[5]
السلام عليكم ورحمة الله وبركاته ..

شٌكرا لك اخي ميتو قمت بتركيبه ولكن توجد مٌشكلة في كومبايل السيرفر

وهو من ملف

combat_zone.cpp

هذا الملف غير مضاف ف السورس عندي والموجود جديد

قمت بإضافته 

في الكومبايل تظهر هذه الرسائل

​combat_zone.cpp: In function 'long int combat_zone_warp_event(LPEVENT, long int)':
combat_zone.cpp:179: error: 'class CHARACTER' has no member named 'm_pkCombatZoneWarpEvent'
combat_zone.cpp: In function 'void WarpSetByTime(CHARACTER*, DWORD, DWORD)':
combat_zone.cpp:189: error: 'class CHARACTER' has no member named 'm_pkCombatZoneWarpEvent'
combat_zone.cpp: In function 'long int combat_zone_leave_event(LPEVENT, long int)':
combat_zone.cpp:207: error: 'class CHARACTER' has no member named 'm_pkCombatZoneLeaveEvent'
combat_zone.cpp:220: error: 'class CHARACTER' has no member named 'UpdateCombatZoneRankings'
combat_zone.cpp:220: error: 'class CHARACTER' has no member named 'GetCombatZonePoints'
combat_zone.cpp:221: error: 'class CHARACTER' has no member named 'SetRealCombatZonePoints'
combat_zone.cpp:221: error: 'class CHARACTER' has no member named 'GetRealCombatZonePoints'
combat_zone.cpp:221: error: 'class CHARACTER' has no member named 'GetCombatZonePoints'
combat_zone.cpp:224: error: 'class CHARACTER' has no member named 'm_pkCombatZoneLeaveEvent'
combat_zone.cpp: In member function 'void CCombatZoneManager::OnResetRanking()':
combat_zone.cpp:230: error: 'TPacketGDCombatZoneResetRanking' was not declared in this scope
combat_zone.cpp:230: error: expected `;' before 'p'
combat_zone.cpp:231: error: 'p' was not declared in this scope
combat_zone.cpp:232: error: 'HEADER_GD_COMBAT_ZONE_RESET_RANKING' was not declared in this scope
combat_zone.cpp: In member function 'void CCombatZoneManager::SendCombatZoneInfoPacket(CHARACTER*, DWORD, std::vector<unsigned int, std::allocator<unsigned int> >)':
combat_zone.cpp:321: error: 'TPacketGCSendCombatZone' was not declared in this scope
combat_zone.cpp:321: error: expected `;' before 'pack'
combat_zone.cpp:322: error: 'pack' was not declared in this scope
combat_zone.cpp:322: error: 'HEADER_GC_SEND_COMBAT_ZONE' was not declared in this scope
combat_zone.cpp: In member function 'void FCombatZoneSendLeavingTargetSign::operator()(CEntity*)':
combat_zone.cpp:357: error: 'TARGET_TYPE_COMBAT_ZONE' was not declared in this scope
combat_zone.cpp: In member function 'void CCombatZoneManager::RefreshLeavingTargetSign(CHARACTER*)':
combat_zone.cpp:402: error: 'TARGET_TYPE_COMBAT_ZONE' was not declared in this scope
combat_zone.cpp: In member function 'void CCombatZoneManager::RequestPotion(CHARACTER*)':
combat_zone.cpp:473: error: 'class CHARACTER' has no member named 'GetRealCombatZonePoints'
combat_zone.cpp: In member function 'void CCombatZoneManager::Leave(CHARACTER*)':
combat_zone.cpp:481: error: 'class CHARACTER' has no member named 'GetCombatZonePoints'
combat_zone.cpp:493: error: 'class CHARACTER' has no member named 'SetRealCombatZonePoints'
combat_zone.cpp:493: error: 'class CHARACTER' has no member named 'GetRealCombatZonePoints'
combat_zone.cpp:493: error: 'class CHARACTER' has no member named 'GetCombatZonePoints'
combat_zone.cpp:533: error: 'class CHARACTER' has no member named 'm_pkCombatZoneLeaveEvent'
combat_zone.cpp:535: error: 'AFFECT_COMBAT_ZONE_MOVEMENT' was not declared in this scope
combat_zone.cpp: In member function 'void CCombatZoneManager::CalculatePointsByKiller(CHARACTER*, bool)':
combat_zone.cpp:635: error: 'class CHARACTER' has no member named 'SetCombatZonePoints'
combat_zone.cpp:635: error: 'class CHARACTER' has no member named 'GetCombatZonePoints'
combat_zone.cpp: In member function 'void CCombatZoneManager::OnDead(CHARACTER*, CHARACTER*)':
combat_zone.cpp:711: error: 'class CHARACTER' has no member named 'GetCombatZonePoints'
combat_zone.cpp:715: error: 'class CHARACTER' has no member named 'SetCombatZoneDeaths'
combat_zone.cpp:715: error: 'class CHARACTER' has no member named 'GetCombatZoneDeaths'
combat_zone.cpp:716: error: 'class CHARACTER' has no member named 'SetCombatZonePoints'
combat_zone.cpp:716: error: 'class CHARACTER' has no member named 'GetCombatZonePoints'
combat_zone.cpp:719: error: 'class CHARACTER' has no member named 'GetCombatZonePoints'
combat_zone.cpp:720: error: 'class CHARACTER' has no member named 'GetCombatZonePoints'
combat_zone.cpp: In member function 'void CCombatZoneManager::RemoveAffect(CHARACTER*)':
combat_zone.cpp:730: error: 'AFFECT_COMBAT_ZONE_MOVEMENT' was not declared in this scope
combat_zone.cpp:731: error: 'AFFECT_COMBAT_ZONE_POTION' was not declared in this scope
combat_zone.cpp:732: error: 'AFFECT_COMBAT_ZONE_DEFENSE' was not declared in this scope
combat_zone.cpp: In member function 'void CCombatZoneManager::OnLogout(CHARACTER*)':
combat_zone.cpp:774: error: 'class CHARACTER' has no member named 'SetCombatZoneDeaths'
combat_zone.cpp:775: error: 'class CHARACTER' has no member named 'SetCombatZonePoints'
combat_zone.cpp: In member function 'void CCombatZoneManager::OnLogin(CHARACTER*)':
combat_zone.cpp:803: error: 'AFFECT_COMBAT_ZONE_DEFENSE' was not declared in this scope
combat_zone.cpp: In member function 'void CCombatZoneManager::AppendSkillCache(CHARACTER*)':
combat_zone.cpp:831: error: 'TPacketGDCombatZoneSkillsCache' was not declared in this scope
combat_zone.cpp:831: error: expected `;' before 'p'
combat_zone.cpp:832: error: 'p' was not declared in this scope
combat_zone.cpp:839: error: 'HEADER_GD_COMBAT_ZONE_SKILLS_CACHE' was not declared in this scope
combat_zone.cpp: In member function 'void CCombatZoneManager::OnRestart(CHARACTER*, int)':
combat_zone.cpp:884: error: 'class CHARACTER' has no member named 'GetCombatZoneDeaths'
combat_zone.cpp:885: error: 'class CHARACTER' has no member named 'SetCombatZoneDeaths'
combat_zone.cpp:888: error: 'class CHARACTER' has no member named 'GetCombatZoneDeaths'
combat_zone.cpp:926: error: 'SCMD_RESTART_COMBAT_ZONE' was not declared in this scope
combat_zone.cpp: In member function 'void CCombatZoneManager::RequestAction(CHARACTER*, const char*)':
combat_zone.cpp:965: error: 'TPacketCGCombatZoneRequestAction' was not declared in this scope
combat_zone.cpp:965: error: 'p' was not declared in this scope
combat_zone.cpp:965: error: expected primary-expression before ')' token
combat_zone.cpp:965: error: expected `;' before 'c_pData'
combat_zone.cpp:976: error: 'class CHARACTER' has no member named 'GetRealCombatZonePoints'
combat_zone.cpp: In member function 'void CCombatZoneManager::RequestRanking(CHARACTER*, DWORD)':
combat_zone.cpp:1061: error: 'TPacketGCCombatZoneRankingData' was not declared in this scope
combat_zone.cpp:1061: error: expected `;' before 'p'
combat_zone.cpp:1062: error: 'p' was not declared in this scope
combat_zone.cpp:1062: error: 'HEADER_GC_RANKING_COMBAT_ZONE' was not declared in this scope
combat_zone.cpp:1066: error: 'TPacketGCCombatZoneRanking' was not declared in this scope
combat_zone.cpp:1078: error: 'TPacketGCCombatZoneRanking' was not declared in this scope
combat_zone.cpp:1100: error: 'TPacketGCCombatZoneRanking' was not declared in this scope
combat_zone.cpp:1108: error: 'TPacketGCCombatZoneRanking' was not declared in this scope
combat_zone.cpp: In member function 'bool CCombatZoneManager::CanUseItem(CHARACTER*, CItem*)':
combat_zone.cpp:1164: error: 'AFFECT_COMBAT_ZONE_POTION' was not declared in this scope
combat_zone.cpp:1171: error: 'AFFECT_COMBAT_ZONE_POTION' was not declared in this scope
combat_zone.cpp:1175: error: 'SE_COMBAT_ZONE_POTION' was not declared in this scope
Makefile:73: recipe for target 'OBJDIR_GAME/combat_zone.o' failed
gmake: *** [OBJDIR_GAME/combat_zone.o] Error 1


مع العلم اني لم اقم بالتعديل على الملف اساساً. هو مرفق وجاهز مع التحميل..

 

غير متواجد
معلومات الكاتب ▼
رقم العضوية : 164
المشاركات : 148
الجنس : ذكر
الدعوات : 1
يتابعهم : 0
يتابعونه : 11
الإجابات المقدمة : 8
الرصيد : 0$
قوة السمعة : 225
موقعي : زيارة موقعي
20-04-2020 02:24 مساء
[6]
راجع تركيبك في Table.h
packet.h
char.cpp/h

توقيع: IGNEEL
dYh3xiw
: DisCord

igneel#8877
غير متواجد
معلومات الكاتب ▼
رقم العضوية : 263
المشاركات : 1
الجنس : ذكر
يتابعهم : 3
يتابعونه : 0
الرصيد : 0$
قوة السمعة : 10
20-04-2020 04:13 مساء
[7]

المشاركة الأصلية كتبت بواسطة: MeTo
   ماشاء الله هذي المشاركات اللي نريدها لجعل مجتمعنا يتطور ويتطور. معا نحن يد واحدة

 
 

تم تحرير الموضوع بواسطة :هلا والله بتاريخ:20-04-2020 04:16 مساء.
غير متواجد
معلومات الكاتب ▼
رقم العضوية : 61
المشاركات : 293
الجنس : ذكر
يتابعهم : 4
يتابعونه : 11
الإجابات المقدمة : 2
الرصيد : 0$
قوة السمعة : 130
20-04-2020 04:32 مساء
[8]
المشاركة الأصلية كتبت بواسطة: Profesor
السلام عليكم ورحمة الله وبركاته ..

شٌكرا لك اخي ميتو قمت بتركيبه ولكن توجد مٌشكلة في كومبايل السيرفر

وهو من ملف

combat_zone.cpp

هذا الملف غير مضاف ف السورس عندي والموجود جديد

قمت بإضافته 

في الكومبايل تظهر هذه الرسائل

​combat_zone.cpp: In function 'long int combat_zone_warp_event(LPEVENT, long int)':
combat_zone.cpp:179: error: 'class CHARACTER' has no member named 'm_pkCombatZoneWarpEvent'
combat_zone.cpp: In function 'void WarpSetByTime(CHARACTER*, DWORD, DWORD)':
combat_zone.cpp:189: error: 'class CHARACTER' has no member named 'm_pkCombatZoneWarpEvent'
combat_zone.cpp: In function 'long int combat_zone_leave_event(LPEVENT, long int)':
combat_zone.cpp:207: error: 'class CHARACTER' has no member named 'm_pkCombatZoneLeaveEvent'
combat_zone.cpp:220: error: 'class CHARACTER' has no member named 'UpdateCombatZoneRankings'
combat_zone.cpp:220: error: 'class CHARACTER' has no member named 'GetCombatZonePoints'
combat_zone.cpp:221: error: 'class CHARACTER' has no member named 'SetRealCombatZonePoints'
combat_zone.cpp:221: error: 'class CHARACTER' has no member named 'GetRealCombatZonePoints'
combat_zone.cpp:221: error: 'class CHARACTER' has no member named 'GetCombatZonePoints'
combat_zone.cpp:224: error: 'class CHARACTER' has no member named 'm_pkCombatZoneLeaveEvent'
combat_zone.cpp: In member function 'void CCombatZoneManager::OnResetRanking()':
combat_zone.cpp:230: error: 'TPacketGDCombatZoneResetRanking' was not declared in this scope
combat_zone.cpp:230: error: expected `;' before 'p'
combat_zone.cpp:231: error: 'p' was not declared in this scope
combat_zone.cpp:232: error: 'HEADER_GD_COMBAT_ZONE_RESET_RANKING' was not declared in this scope
combat_zone.cpp: In member function 'void CCombatZoneManager::SendCombatZoneInfoPacket(CHARACTER*, DWORD, std::vector<unsigned int, std::allocator<unsigned int> >)':
combat_zone.cpp:321: error: 'TPacketGCSendCombatZone' was not declared in this scope
combat_zone.cpp:321: error: expected `;' before 'pack'
combat_zone.cpp:322: error: 'pack' was not declared in this scope
combat_zone.cpp:322: error: 'HEADER_GC_SEND_COMBAT_ZONE' was not declared in this scope
combat_zone.cpp: In member function 'void FCombatZoneSendLeavingTargetSign::operator()(CEntity*)':
combat_zone.cpp:357: error: 'TARGET_TYPE_COMBAT_ZONE' was not declared in this scope
combat_zone.cpp: In member function 'void CCombatZoneManager::RefreshLeavingTargetSign(CHARACTER*)':
combat_zone.cpp:402: error: 'TARGET_TYPE_COMBAT_ZONE' was not declared in this scope
combat_zone.cpp: In member function 'void CCombatZoneManager::RequestPotion(CHARACTER*)':
combat_zone.cpp:473: error: 'class CHARACTER' has no member named 'GetRealCombatZonePoints'
combat_zone.cpp: In member function 'void CCombatZoneManager::Leave(CHARACTER*)':
combat_zone.cpp:481: error: 'class CHARACTER' has no member named 'GetCombatZonePoints'
combat_zone.cpp:493: error: 'class CHARACTER' has no member named 'SetRealCombatZonePoints'
combat_zone.cpp:493: error: 'class CHARACTER' has no member named 'GetRealCombatZonePoints'
combat_zone.cpp:493: error: 'class CHARACTER' has no member named 'GetCombatZonePoints'
combat_zone.cpp:533: error: 'class CHARACTER' has no member named 'm_pkCombatZoneLeaveEvent'
combat_zone.cpp:535: error: 'AFFECT_COMBAT_ZONE_MOVEMENT' was not declared in this scope
combat_zone.cpp: In member function 'void CCombatZoneManager::CalculatePointsByKiller(CHARACTER*, bool)':
combat_zone.cpp:635: error: 'class CHARACTER' has no member named 'SetCombatZonePoints'
combat_zone.cpp:635: error: 'class CHARACTER' has no member named 'GetCombatZonePoints'
combat_zone.cpp: In member function 'void CCombatZoneManager::OnDead(CHARACTER*, CHARACTER*)':
combat_zone.cpp:711: error: 'class CHARACTER' has no member named 'GetCombatZonePoints'
combat_zone.cpp:715: error: 'class CHARACTER' has no member named 'SetCombatZoneDeaths'
combat_zone.cpp:715: error: 'class CHARACTER' has no member named 'GetCombatZoneDeaths'
combat_zone.cpp:716: error: 'class CHARACTER' has no member named 'SetCombatZonePoints'
combat_zone.cpp:716: error: 'class CHARACTER' has no member named 'GetCombatZonePoints'
combat_zone.cpp:719: error: 'class CHARACTER' has no member named 'GetCombatZonePoints'
combat_zone.cpp:720: error: 'class CHARACTER' has no member named 'GetCombatZonePoints'
combat_zone.cpp: In member function 'void CCombatZoneManager::RemoveAffect(CHARACTER*)':
combat_zone.cpp:730: error: 'AFFECT_COMBAT_ZONE_MOVEMENT' was not declared in this scope
combat_zone.cpp:731: error: 'AFFECT_COMBAT_ZONE_POTION' was not declared in this scope
combat_zone.cpp:732: error: 'AFFECT_COMBAT_ZONE_DEFENSE' was not declared in this scope
combat_zone.cpp: In member function 'void CCombatZoneManager::OnLogout(CHARACTER*)':
combat_zone.cpp:774: error: 'class CHARACTER' has no member named 'SetCombatZoneDeaths'
combat_zone.cpp:775: error: 'class CHARACTER' has no member named 'SetCombatZonePoints'
combat_zone.cpp: In member function 'void CCombatZoneManager::OnLogin(CHARACTER*)':
combat_zone.cpp:803: error: 'AFFECT_COMBAT_ZONE_DEFENSE' was not declared in this scope
combat_zone.cpp: In member function 'void CCombatZoneManager::AppendSkillCache(CHARACTER*)':
combat_zone.cpp:831: error: 'TPacketGDCombatZoneSkillsCache' was not declared in this scope
combat_zone.cpp:831: error: expected `;' before 'p'
combat_zone.cpp:832: error: 'p' was not declared in this scope
combat_zone.cpp:839: error: 'HEADER_GD_COMBAT_ZONE_SKILLS_CACHE' was not declared in this scope
combat_zone.cpp: In member function 'void CCombatZoneManager::OnRestart(CHARACTER*, int)':
combat_zone.cpp:884: error: 'class CHARACTER' has no member named 'GetCombatZoneDeaths'
combat_zone.cpp:885: error: 'class CHARACTER' has no member named 'SetCombatZoneDeaths'
combat_zone.cpp:888: error: 'class CHARACTER' has no member named 'GetCombatZoneDeaths'
combat_zone.cpp:926: error: 'SCMD_RESTART_COMBAT_ZONE' was not declared in this scope
combat_zone.cpp: In member function 'void CCombatZoneManager::RequestAction(CHARACTER*, const char*)':
combat_zone.cpp:965: error: 'TPacketCGCombatZoneRequestAction' was not declared in this scope
combat_zone.cpp:965: error: 'p' was not declared in this scope
combat_zone.cpp:965: error: expected primary-expression before ')' token
combat_zone.cpp:965: error: expected `;' before 'c_pData'
combat_zone.cpp:976: error: 'class CHARACTER' has no member named 'GetRealCombatZonePoints'
combat_zone.cpp: In member function 'void CCombatZoneManager::RequestRanking(CHARACTER*, DWORD)':
combat_zone.cpp:1061: error: 'TPacketGCCombatZoneRankingData' was not declared in this scope
combat_zone.cpp:1061: error: expected `;' before 'p'
combat_zone.cpp:1062: error: 'p' was not declared in this scope
combat_zone.cpp:1062: error: 'HEADER_GC_RANKING_COMBAT_ZONE' was not declared in this scope
combat_zone.cpp:1066: error: 'TPacketGCCombatZoneRanking' was not declared in this scope
combat_zone.cpp:1078: error: 'TPacketGCCombatZoneRanking' was not declared in this scope
combat_zone.cpp:1100: error: 'TPacketGCCombatZoneRanking' was not declared in this scope
combat_zone.cpp:1108: error: 'TPacketGCCombatZoneRanking' was not declared in this scope
combat_zone.cpp: In member function 'bool CCombatZoneManager::CanUseItem(CHARACTER*, CItem*)':
combat_zone.cpp:1164: error: 'AFFECT_COMBAT_ZONE_POTION' was not declared in this scope
combat_zone.cpp:1171: error: 'AFFECT_COMBAT_ZONE_POTION' was not declared in this scope
combat_zone.cpp:1175: error: 'SE_COMBAT_ZONE_POTION' was not declared in this scope
Makefile:73: recipe for target 'OBJDIR_GAME/combat_zone.o' failed
gmake: *** [OBJDIR_GAME/combat_zone.o] Error 1


مع العلم اني لم اقم بالتعديل على الملف اساساً. هو مرفق وجاهز مع التحميل..

 

كما قال IGNEEL راجع تركيب الملفات المذكورة

توقيع: MeTo

Discord: MeTo#3992


 
غير متواجد
معلومات الكاتب ▼
رقم العضوية : 61
المشاركات : 293
الجنس : ذكر
يتابعهم : 4
يتابعونه : 11
الإجابات المقدمة : 2
الرصيد : 0$
قوة السمعة : 130
20-04-2020 04:32 مساء
[9]
المشاركة الأصلية كتبت بواسطة: هلا والله

المشاركة الأصلية كتبت بواسطة: MeTo
   ماشاء الله هذي المشاركات اللي نريدها لجعل مجتمعنا يتطور ويتطور. معا نحن يد واحدة

 
 

هذا واجب صديقي 

توقيع: MeTo

Discord: MeTo#3992


 
غير متواجد
معلومات الكاتب ▼
رقم العضوية : 61
المشاركات : 293
الجنس : ذكر
يتابعهم : 4
يتابعونه : 11
الإجابات المقدمة : 2
الرصيد : 0$
قوة السمعة : 130
20-04-2020 04:35 مساء
[10]
المشاركة الأصلية كتبت بواسطة: KrOoS
موضوع جميل تفيد ناس كثير ،، في الاضافات و حصريات ملفاتهم و سيرفراتهم العيب الوحيد فيها الي ما يعرف يركبها او يعربها هناً المشكلة

اأنت اجمل صديقي 

توقيع: MeTo

Discord: MeTo#3992